Sujet: Problème d'installation bcompiler sur Raspbmc

Le
Nicolas Roussel
Bonjour à tous,

J'ai installé la dernière version de la distribution Raspbmc en date =
du
13-12-12, celle-ci est basé sur une "wheezy" d'après ce que j'ai cru
comprendre.

J'ai installé Php 5.4.4-10, php info ici :
http://pastie.org/private/0n79piv0pg4p8c0xcpa8zg

Je souhaiterais installer bcompiler sur la machine j'ai donc installé =
les
paquets suivants en plus plus de apache et php: "dh-make-php fakeroot
libicu-dev xsltproc php-pear libicu48 php5-dev make php5-xcache"

Mon problème interviens lorsque je lance la commande : "pecl install
bcompiler"

Tout semble se passé bien jusqu'au "make", si vous pouviez m'aider ce =
serait
très gentil je ne sais pas comment faire


root@raspbmc:~# pecl install bcompiler
downloading bcompiler-1.0.2.tgz
Starting to download bcompiler-1.0.2.tgz (57,347 bytes)
..done: 57,347 bytes
11 source files, building
running: phpize
Configuring for:
PHP Api Version: 20100412
Zend Module Api No: 20100525
Zend Extension Api No: 220100525
building in /tmp/pear/temp/pear-build-rootNoHH38/bcompiler-1.0.2
running: /tmp/pear/temp/bcompiler/configure
checking for grep that handles long lines and -e /bin/grep
checking for egrep /bin/grep -E
checking for a sed that does not truncate output /bin/sed
checking for cc cc
checking whether the C compiler works yes
checking for C compiler default output file name a.out
checking for suffix of executables
checking whether we are cross compiling no
checking for suffix of object files o
checking whether we are using the GNU C compiler yes
checking whether cc accepts -g yes
checking for cc option to accept ISO C89 none needed
checking how to run the C preprocessor cc -E
checking for icc no
checking for suncc no
checking whether cc understands -c and -o together yes
checking for system library directory lib
checking if compiler supports -R no
checking if compiler supports -Wl,-rpath, yes
checking build system type armv6l-unknown-linux-gnueabihf
checking host system type armv6l-unknown-linux-gnueabihf
checking target system type armv6l-unknown-linux-gnueabihf
checking for PHP prefix /usr
checking for PHP includes -I/usr/include/php5 =
-I/usr/include/php5/main
-I/usr/include/php5/TSRM -I/usr/include/php5/Zend =
-I/usr/include/php5/ext
-I/usr/include/php5/ext/date/lib -D_LARGEFILE_SOURCE =
-D_FILE_OFFSET_BITS=64
checking for PHP extension directory /usr/lib/php5/20100525+lfs
checking for PHP installed headers prefix /usr/include/php5
checking if debug is enabled no
checking if zts is enabled no
checking for re2c no
configure: WARNING: You will need re2c 0.13.4 or later if you want to
regenerate PHP parsers.
checking for gawk no
checking for nawk nawk
checking if nawk is broken no
checking whether to enable bcompiler support yes, shared
checking whether to include debug code in bcompiler (default: no) no
checking how to print strings printf
checking for a sed that does not truncate output (cached) /bin/sed
checking for fgrep /bin/grep -F
checking for ld used by cc /usr/bin/ld
checking if the linker (/usr/bin/ld) is GNU ld yes
checking for BSD- or MS-compatible name lister (nm) /usr/bin/nm -B
checking the name lister (/usr/bin/nm -B) interface BSD nm
checking whether ln -s works yes
checking the maximum length of command line arguments 1572864
checking whether the shell understands some XSI constructs yes
checking whether the shell understands "+=" yes
checking how to convert armv6l-unknown-linux-gnueabihf file names to
armv6l-unknown-linux-gnueabihf format func_convert_file_noop
checking how to convert armv6l-unknown-linux-gnueabihf file names to
toolchain format func_convert_file_noop
checking for /usr/bin/ld option to reload object files -r
checking for objdump objdump
checking how to recognize dependent libraries pass_all
checking for dlltool no
checking how to associate runtime and link libraries printf %s
checking for ar ar
checking for archiver @FILE support @
checking for strip strip
checking for ranlib ranlib
checking for gawk (cached) nawk
checking command to parse /usr/bin/nm -B output from cc object ok
checking for sysroot no
checking for mt mt
checking if mt is a manifest tool no
checking for ANSI C header files yes
checking for sys/types.h yes
checking for sys/stat.h yes
checking for stdlib.h yes
checking for string.h yes
checking for memory.h yes
checking for strings.h yes
checking for inttypes.h yes
checking for stdint.h yes
checking for unistd.h yes
checking for dlfcn.h yes
checking for objdir .libs
checking if cc supports -fno-rtti -fno-exceptions no
checking for cc option to produce PIC -fPIC -DPIC
checking if cc PIC flag -fPIC -DPIC works yes
checking if cc static flag -static works yes
checking if cc supports -c -o file.o yes
checking if cc supports -c -o file.o (cached) yes
checking whether the cc linker (/usr/bin/ld) supports shared =
libraries
yes
checking whether -lc should be explicitly linked in no
checking dynamic linker characteristics GNU/Linux ld.so
checking how to hardcode library paths into programs immediate
checking whether stripping libraries is possible yes
checking if libtool supports shared libraries yes
checking whether to build shared libraries yes
checking whether to build static libraries no
configure: creating ./config.status
config.status: creating config.h
config.status: executing libtool commands
running: make
/bin/bash /tmp/pear/temp/pear-build-rootNoHH38/bcompiler-1.0.2/libtool
--mode=compile cc -I. -I/tmp/pear/temp/bcompiler -DPHP_ATOM_INC
-I/tmp/pear/temp/pear-build-rootNoHH38/bcompiler-1.0.2/include
-I/tmp/pear/temp/pear-build-rootNoHH38/bcompiler-1.0.2/main
-I/tmp/pear/temp/bcompiler -I/usr/include/php5 -I/usr/include/php5/main
-I/usr/include/php5/TSRM -I/usr/include/php5/Zend =
-I/usr/include/php5/ext
-I/usr/include/php5/ext/date/lib -D_LARGEFILE_SOURCE =
-D_FILE_OFFSET_BITS=64
-DHAVE_CONFIG_H -g -O2 -c /tmp/pear/temp/bcompiler/php_bcompiler.c -o
php_bcompiler.lo
libtool: compile: cc -I. -I/tmp/pear/temp/bcompiler -DPHP_ATOM_INC
-I/tmp/pear/temp/pear-build-rootNoHH38/bcompiler-1.0.2/include
-I/tmp/pear/temp/pear-build-rootNoHH38/bcompiler-1.0.2/main
-I/tmp/pear/temp/bcompiler -I/usr/include/php5 -I/usr/include/php5/main
-I/usr/include/php5/TSRM -I/usr/include/php5/Zend =
-I/usr/include/php5/ext
-I/usr/include/php5/ext/date/lib -D_LARGEFILE_SOURCE =
-D_FILE_OFFSET_BITS=64
-DHAVE_CONFIG_H -g -O2 -c /tmp/pear/temp/bcompiler/php_bcompiler.c =
-fPIC
-DPIC -o .libs/php_bcompiler.o
/tmp/pear/temp/bcompiler/php_bcompiler.c: In function
'_bcompiler_write_functions_from_file':
/tmp/pear/temp/bcompiler/php_bcompiler.c:468:6: warning: passing =
argument 1
of 'apc_serialize_zstring' discards 'const' qualifier from pointer =
target
type [enabled by default]
/tmp/pear/temp/bcompiler/php_bcompiler.h:298:6: note: expected 'char *' =
but
argument is of type 'const char *'
/tmp/pear/temp/bcompiler/php_bcompiler.c: In function
'zif_bcompiler_write_file':
/tmp/pear/temp/bcompiler/php_bcompiler.c:574:10: error: =
'zend_class_entry'
has no member named 'filename'
/tmp/pear/temp/bcompiler/php_bcompiler.c:574:24: error: =
'zend_class_entry'
has no member named 'filename'
/tmp/pear/temp/bcompiler/php_bcompiler.c:574:24: error: =
'zend_class_entry'
has no member named 'filename'
/tmp/pear/temp/bcompiler/php_bcompiler.c:574:24: error: =
'zend_class_entry'
has no member named 'filename'
/tmp/pear/temp/bcompiler/php_bcompiler.c:574:24: error: =
'zend_class_entry'
has no member named 'filename'
/tmp/pear/temp/bcompiler/php_bcompiler.c:574:24: error: =
'zend_class_entry'
has no member named 'filename'
/tmp/pear/temp/bcompiler/php_bcompiler.c:574:24: error: =
'zend_class_entry'
has no member named 'filename'
/tmp/pear/temp/bcompiler/php_bcompiler.c:574:24: error: =
'zend_class_entry'
has no member named 'filename'
/tmp/pear/temp/bcompiler/php_bcompiler.c:574:24: error: =
'zend_class_entry'
has no member named 'filename'
/tmp/pear/temp/bcompiler/php_bcompiler.c:574:24: error: =
'zend_class_entry'
has no member named 'filename'
/tmp/pear/temp/bcompiler/php_bcompiler.c:574:24: error: =
'zend_class_entry'
has no member named 'filename'
/tmp/pear/temp/bcompiler/php_bcompiler.c:574:24: error: =
'zend_class_entry'
has no member named 'filename'
/tmp/pear/temp/bcompiler/php_bcompiler.c:574:24: error: =
'zend_class_entry'
has no member named 'filename'
/tmp/pear/temp/bcompiler/php_bcompiler.c:574:24: error: =
'zend_class_entry'
has no member named 'filename'
/tmp/pear/temp/bcompiler/php_bcompiler.c:574:24: error: =
'zend_class_entry'
has no member named 'filename'
/tmp/pear/temp/bcompiler/php_bcompiler.c:574:24: error: =
'zend_class_entry'
has no member named 'filename'
/tmp/pear/temp/bcompiler/php_bcompiler.c:574:24: error: =
'zend_class_entry'
has no member named 'filename'
/tmp/pear/temp/bcompiler/php_bcompiler.c:574:24: error: =
'zend_class_entry'
has no member named 'filename'
/tmp/pear/temp/bcompiler/php_bcompiler.c:574:24: error: =
'zend_class_entry'
has no member named 'filename'
/tmp/pear/temp/bcompiler/php_bcompiler.c:574:24: error: =
'zend_class_entry'
has no member named 'filename'
/tmp/pear/temp/bcompiler/php_bcompiler.c:574:24: error: =
'zend_class_entry'
has no member named 'filename'
/tmp/pear/temp/bcompiler/php_bcompiler.c:581:5: warning: passing =
argument 4
of 'apc_serialize_zend_class_entry' discards 'const' qualifier from =
pointer
target type [enabled by default]
/tmp/pear/temp/bcompiler/php_bcompiler.h:305:6: note: expected 'char *' =
but
argument is of type 'const char *'
/tmp/pear/temp/bcompiler/php_bcompiler.c:635:10: error: =
'zend_class_entry'
has no member named 'filename'
/tmp/pear/temp/bcompiler/php_bcompiler.c:635:24: error: =
'zend_class_entry'
has no member named 'filename'
/tmp/pear/temp/bcompiler/php_bcompiler.c:635:24: error: =
'zend_class_entry'
has no member named 'filename'
/tmp/pear/temp/bcompiler/php_bcompiler.c:635:24: error: =
'zend_class_entry'
has no member named 'filename'
/tmp/pear/temp/bcompiler/php_bcompiler.c:635:24: error: =
'zend_class_entry'
has no member named 'filename'
/tmp/pear/temp/bcompiler/php_bcompiler.c:635:24: error: =
'zend_class_entry'
has no member named 'filename'
/tmp/pear/temp/bcompiler/php_bcompiler.c:635:24: error: =
'zend_class_entry'
has no member named 'filename'
/tmp/pear/temp/bcompiler/php_bcompiler.c:635:24: error: =
'zend_class_entry'
has no member named 'filename'
/tmp/pear/temp/bcompiler/php_bcompiler.c:635:24: error: =
'zend_class_entry'
has no member named 'filename'
/tmp/pear/temp/bcompiler/php_bcompiler.c:635:24: error: =
'zend_class_entry'
has no member named 'filename'
/tmp/pear/temp/bcompiler/php_bcompiler.c:635:24: error: =
'zend_class_entry'
has no member named 'filename'
/tmp/pear/temp/bcompiler/php_bcompiler.c:635:24: error: =
'zend_class_entry'
has no member named 'filename'
/tmp/pear/temp/bcompiler/php_bcompiler.c:635:24: error: =
'zend_class_entry'
has no member named 'filename'
/tmp/pear/temp/bcompiler/php_bcompiler.c:635:24: error: =
'zend_class_entry'
has no member named 'filename'
/tmp/pear/temp/bcompiler/php_bcompiler.c:635:24: error: =
'zend_class_entry'
has no member named 'filename'
/tmp/pear/temp/bcompiler/php_bcompiler.c:635:24: error: =
'zend_class_entry'
has no member named 'filename'
/tmp/pear/temp/bcompiler/php_bcompiler.c:635:24: error: =
'zend_class_entry'
has no member named 'filename'
/tmp/pear/temp/bcompiler/php_bcompiler.c:635:24: error: =
'zend_class_entry'
has no member named 'filename'
/tmp/pear/temp/bcompiler/php_bcompiler.c:635:24: error: =
'zend_class_entry'
has no member named 'filename'
/tmp/pear/temp/bcompiler/php_bcompiler.c:635:24: error: =
'zend_class_entry'
has no member named 'filename'
/tmp/pear/temp/bcompiler/php_bcompiler.c:635:24: error: =
'zend_class_entry'
has no member named 'filename'
make: *** [php_bcompiler.lo] Error 1
ERROR: `make' failed






--
Lisez la FAQ de la liste avant de poser une question :
http://wiki.debian.org/fr/FrenchLists

Pour vous DESABONNER, envoyez un message avec comme objet "unsubscribe"
vers debian-user-french-REQUEST@lists.debian.org
En cas de soucis, contactez EN ANGLAIS listmaster@lists.debian.org
Archive: http://lists.debian.org/001701cdda03$37f01390$a7d03ab0$@gmail.com
Vidéos High-Tech et Jeu Vidéo
Téléchargements
Vos réponses
Gagnez chaque mois un abonnement Premium avec GNT : Inscrivez-vous !
Trier par : date / pertinence
moi-meme
Le #25074122
Le Fri, 14 Dec 2012 15:20:01 +0100, Nicolas Roussel a écrit :

Je souhaiterais installer bcompiler sur la machine j'ai donc installé
les paquets suivants en plus plus de apache et php: "dh-make-php
fakeroot libicu-dev xsltproc php-pear libicu48 php5-dev make
php5-xcache"



je ne suis pas sur raspbmc mais sur raspbian. Je ne sais pas si raspbmc
est le meilleur environnement pour compiler.

Ne manquerait-il pas un paquet du fait des étiquettes non résolues ?
dans ce qui semble être le résultat d'un configure, il manque des choses
par exemple :

checking how to recognize dependent libraries... pass_all checking for
dlltool... no

lancer un configure tout seul ?
Voir le README ou le install parce que souvent il y a des infos (pour la
compilation de LyX ça m'a bien aidé).

--
Lisez la FAQ de la liste avant de poser une question :
http://wiki.debian.org/fr/FrenchLists

Pour vous DESABONNER, envoyez un message avec comme objet "unsubscribe"
vers
En cas de soucis, contactez EN ANGLAIS
Archive: http://lists.debian.org/50d2ca4a$0$2044$
Publicité
Poster une réponse
Anonyme